Reaction Details
TargetC-X-C chemokine receptor type 3
LigandBDBM50227873
Substrate/Competitorn/a
Meas. Tech.ChEMBL_461636 (CHEMBL928754)
Ki 180±n/a nM
Citation Watson, RJAllen, DRBirch, HLChapman, GAGalvin, FCJopling, LAKnight, RLMeier, DOliver, KMeissner, JWOwen, DAThomas, EJTremayne, NWilliams, SC Development of CXCR3 antagonists. Part 3: Tropenyl and homotropenyl-piperidine urea derivatives. Bioorg Med Chem Lett18:147-51 (2008) 
 
C-X-C chemokine receptor type 3
Name:C-X-C chemokine receptor type 3
Type:PROTEIN
Mol. Mass.:41020.84
Organism:Mus musculus
Description:ChEMBL_560734
Residue:367
BDBM50227873
NameBDBM50227873
Synonyms:1-(3-fluoro-5-(trifluoromethyl)phenyl)-3-(1-((8-isobutyryl-8-aza-bicyclo[3.2.1]oct-2-en-3-yl)methyl)piperidin-4-yl)urea | CHEMBL253102
TypeSmall organic molecule
Emp. Form.C25H32F4N4O2
Mol. Mass.496.5408
SMILESCC(C)C(=O)N1C2CCC1C=C(CN1CCC(CC1)NC(=O)Nc1cc(F)cc(c1)C(F)(F)F)C2