Reaction Details
TargetC-X-C chemokine receptor type 3
LigandBDBM50227874
Substrate/Competitorn/a
Meas. Tech.ChEMBL_461636 (CHEMBL928754)
Ki 950±n/a nM
Citation Watson, RJAllen, DRBirch, HLChapman, GAGalvin, FCJopling, LAKnight, RLMeier, DOliver, KMeissner, JWOwen, DAThomas, EJTremayne, NWilliams, SC Development of CXCR3 antagonists. Part 3: Tropenyl and homotropenyl-piperidine urea derivatives. Bioorg Med Chem Lett18:147-51 (2008) 
 
C-X-C chemokine receptor type 3
Name:C-X-C chemokine receptor type 3
Type:PROTEIN
Mol. Mass.:41020.84
Organism:Mus musculus
Description:ChEMBL_560734
Residue:367
BDBM50227874
NameBDBM50227874
Synonyms:3-{4-[3-(3-fluoro-5-trifluoromethyl-phenyl)-ureido]-piperidin-1-ylmethyl}-8-aza-bicyclo[3.2.1]oct-2-ene-8-carboxylic acid ethyl ester | CHEMBL253928
TypeSmall organic molecule
Emp. Form.C24H30F4N4O3
Mol. Mass.498.5136
SMILESCCOC(=O)N1C2CCC1C=C(CN1CCC(CC1)NC(=O)Nc1cc(F)cc(c1)C(F)(F)F)C2