Reaction Details
Target72 kDa type IV collagenase
LigandBDBM50203538
Substrate/Competitorn/a
Meas. Tech.ChEMBL_461665 (CHEMBL927686)
IC50 13±n/a nM
Citation Yao, WZhuo, JBurns, DMLi, YLQian, DQZhang, CHe, CXu, MShi, ELi, YMarando, CACovington, MBYang, GLiu, XPan, MFridman, JSScherle, PWasserman, ZRHollis, GVaddi, KYeleswaram, SNewton, RFriedman, SMetcalf, B Design and identification of selective HER-2 sheddase inhibitors via P1' manipulation and unconventional P2' perturbations to induce a molecular metamorphosis. Bioorg Med Chem Lett18:159-63 (2008) 
 
72 kDa type IV collagenase
Name:72 kDa type IV collagenase
Type:Enzyme
Mol. Mass.:73870.36
Organism:Homo sapiens (Human)
Description: P08253
Residue:660
BDBM50203538
NameBDBM50203538
Synonyms:(6S,7S)-6-(3-phenyl-2,5-dihydro-pyrrole-1-carbonyl)-5-aza-spiro[2.5]octane-7-carboxylic acid hydroxyamide CHEMBL375418
TypeSmall organic molecule
Emp. Form.C19H23N3O3
Mol. Mass.341.4042
SMILESONC(=O)[C@H]1CC2(CC2)CN[C@@H]1C(=O)N1CC=C(C1)c1ccccc1