Reaction Details
Target72 kDa type IV collagenase
LigandBDBM50203526
Substrate/Competitorn/a
Meas. Tech.ChEMBL_461665 (CHEMBL927686)
IC50 5±n/a nM
Citation Yao, WZhuo, JBurns, DMLi, YLQian, DQZhang, CHe, CXu, MShi, ELi, YMarando, CACovington, MBYang, GLiu, XPan, MFridman, JSScherle, PWasserman, ZRHollis, GVaddi, KYeleswaram, SNewton, RFriedman, SMetcalf, B Design and identification of selective HER-2 sheddase inhibitors via P1' manipulation and unconventional P2' perturbations to induce a molecular metamorphosis. Bioorg Med Chem Lett18:159-63 (2008) 
 
72 kDa type IV collagenase
Name:72 kDa type IV collagenase
Type:Enzyme
Mol. Mass.:73870.36
Organism:Homo sapiens (Human)
Description: P08253
Residue:660
BDBM50203526
NameBDBM50203526
Synonyms:(6S,7S)-6-(4-phenyl-3,6-dihydro-2H-pyridine-1-carbonyl)-5-aza-spiro[2.5]octane-7-carboxylic acid hydroxyamide (6S,7S)-N-hydroxy-6-[(4-phenyl-3,6-dihydropyridin-1(2H)-yl)carbonyl]-5-azaspiro[2.5]octane-7-carboxamide | CHEMBL373532
TypeSmall organic molecule
Emp. Form.C20H25N3O3
Mol. Mass.355.4308
SMILESONC(=O)[C@H]1CC2(CC2)CN[C@@H]1C(=O)N1CCC(=CC1)c1ccccc1