Reaction Details
TargetDisintegrin and metalloproteinase domain-containing protein 10
LigandBDBM50227996
Substrate/Competitorn/a
Meas. Tech.ChEMBL_461662 (CHEMBL927683)
IC50 19±n/a nM
Citation Yao, WZhuo, JBurns, DMLi, YLQian, DQZhang, CHe, CXu, MShi, ELi, YMarando, CACovington, MBYang, GLiu, XPan, MFridman, JSScherle, PWasserman, ZRHollis, GVaddi, KYeleswaram, SNewton, RFriedman, SMetcalf, B Design and identification of selective HER-2 sheddase inhibitors via P1' manipulation and unconventional P2' perturbations to induce a molecular metamorphosis. Bioorg Med Chem Lett18:159-63 (2008) 
 
Disintegrin and metalloproteinase domain-containing protein 10
Name:Disintegrin and metalloproteinase domain-containing protein 10
Type:Enzyme
Mol. Mass.:84160.93
Organism:Homo sapiens (Human)
Description:O14672
Residue:748
BDBM50227996
NameBDBM50227996
Synonyms:(6S,7S)-7-hydroxycarbamoyl-6-(4-phenyl-3,4-dihydro-2H-pyridine-1-carbonyl)-5-aza-spiro[2.5]octane-5-carboxylic acid isobutyl ester | CHEMBL403185
TypeSmall organic molecule
Emp. Form.C25H33N3O5
Mol. Mass.455.5466
SMILESCC(C)COC(=O)N1CC2(CC2)C[C@@H]([C@H]1C(=O)N1CCC(C=C1)c1ccccc1)C(=O)NO