Reaction Details
TargetCannabinoid receptor 2
LigandBDBM50061116
Substrate/Competitorn/a
Meas. Tech.ChEMBL_452383 (CHEMBL901623)
Ki 3.1±n/a nM
Citation Khanolkar, ADLu, DIbrahim, MDuclos, RIThakur, GAMalan, TPPorreca, FVeerappan, VTian, XGeorge, CParrish, DAPapahatjis, DPMakriyannis, A Cannabilactones: a novel class of CB2 selective agonists with peripheral analgesic activity. J Med Chem50:6493-500 (2007) 
 
Cannabinoid receptor 2
Name:Cannabinoid receptor 2
Type:Enzyme Catalytic Domain
Mol. Mass.:38220.43
Organism:MOUSE
Description:P47936
Residue:347
BDBM50061116
NameBDBM50061116
Synonyms:3-(1',1'-dimethylheptyl)-1-hydroxy-9-methyl-6H-benzo[c]-chromene-6-one CHEMBL113230
TypeSmall organic molecule
Emp. Form.C23H28O3
Mol. Mass.352.4666
SMILESCCCCCCC(C)(C)c1cc(O)c2c(c1)oc(=O)c1ccc(C)cc21