Reaction Details
Target5-hydroxytryptamine receptor 6
LigandBDBM50228652
Substrate/Competitorn/a
Meas. Tech.ChEMBL_461681 (CHEMBL927702)
Ki 715±n/a nM
Citation Seong, CMPark, WKPark, CMKong, JYPark, NS Discovery of 3-aryl-3-methyl-1H-quinoline-2,4-diones as a new class of selective 5-HT6 receptor antagonists. Bioorg Med Chem Lett18:738-43 (2008) 
 
5-hydroxytryptamine receptor 6
Name:5-hydroxytryptamine receptor 6
Type:G Protein-Coupled Receptor (GPCR)
Mol. Mass.:46968.43
Organism:Homo sapiens (Human)
Description:P50406
Residue:440
BDBM50228652
NameBDBM50228652
Synonyms:5-chloro-7-(dimethylamino)-3-methyl-3-phenylquinoline-2,4(1H,3H)-dione | CHEMBL251861
TypeSmall organic molecule
Emp. Form.C18H17ClN2O2
Mol. Mass.328.793
SMILESCN(C)c1cc(Cl)c2C(=O)C(C)(C(=O)Nc2c1)c1ccccc1