Reaction Details
Target5-hydroxytryptamine receptor 6
LigandBDBM50228655
Substrate/Competitorn/a
Meas. Tech.ChEMBL_461681 (CHEMBL927702)
Ki 293±n/a nM
Citation Seong, CMPark, WKPark, CMKong, JYPark, NS Discovery of 3-aryl-3-methyl-1H-quinoline-2,4-diones as a new class of selective 5-HT6 receptor antagonists. Bioorg Med Chem Lett18:738-43 (2008) 
 
5-hydroxytryptamine receptor 6
Name:5-hydroxytryptamine receptor 6
Type:G Protein-Coupled Receptor (GPCR)
Mol. Mass.:46968.43
Organism:Homo sapiens (Human)
Description:P50406
Residue:440
BDBM50228655
NameBDBM50228655
Synonyms:(S)-5,7-dichloro-3-(4-methoxyphenyl)-3-methylquinoline-2,4(1H,3H)-dione | CHEMBL254330
TypeSmall organic molecule
Emp. Form.C17H13Cl2NO3
Mol. Mass.350.196
SMILESCOc1ccc(cc1)[C@]1(C)C(=O)Nc2cc(Cl)cc(Cl)c2C1=O