Reaction Details
Target5-hydroxytryptamine receptor 6
LigandBDBM50130264
Substrate/Competitorn/a
Meas. Tech.ChEMBL_461681 (CHEMBL927702)
Ki 1.4±n/a nM
Citation Seong, CMPark, WKPark, CMKong, JYPark, NS Discovery of 3-aryl-3-methyl-1H-quinoline-2,4-diones as a new class of selective 5-HT6 receptor antagonists. Bioorg Med Chem Lett18:738-43 (2008) 
 
5-hydroxytryptamine receptor 6
Name:5-hydroxytryptamine receptor 6
Type:G Protein-Coupled Receptor (GPCR)
Mol. Mass.:46968.43
Organism:Homo sapiens (Human)
Description:P50406
Residue:440
BDBM50130264
NameBDBM50130264
Synonyms:5-(1,4-diazepan-1-yl)-2-(4-fluorophenylsulfonyl)-N-methylbenzenamine [5-[1,4]Diazepan-1-yl-2-(4-fluoro-benzenesulfonyl)-phenyl]-methyl-amine
TypeSmall organic molecule
Emp. Form.C18H22FN3O2S
Mol. Mass.363.45
SMILESCNc1cc(ccc1S(=O)(=O)c1ccc(F)cc1)N1CCCNCC1