Reaction Details
Target5-hydroxytryptamine receptor 6
LigandBDBM50130268
Substrate/Competitorn/a
Meas. Tech.ChEMBL_461681 (CHEMBL927702)
Ki 3±n/a nM
Citation Seong, CMPark, WKPark, CMKong, JYPark, NS Discovery of 3-aryl-3-methyl-1H-quinoline-2,4-diones as a new class of selective 5-HT6 receptor antagonists. Bioorg Med Chem Lett18:738-43 (2008) 
 
5-hydroxytryptamine receptor 6
Name:5-hydroxytryptamine receptor 6
Type:G Protein-Coupled Receptor (GPCR)
Mol. Mass.:46968.43
Organism:Homo sapiens (Human)
Description:P50406
Residue:440
BDBM50130268
NameBDBM50130268
Synonyms:CHEMBL329383 N-(2,5-dibromo-3-fluorophenyl)-4-methoxy-3-(piperazin-1-yl)benzenesulfonamide | SB-357134
TypeSmall organic molecule
Emp. Form.C17H18Br2FN3O3S
Mol. Mass.523.215
SMILESCOc1ccc(cc1N1CCNCC1)S(=O)(=O)Nc1cc(Br)cc(F)c1Br