Reaction Details
TargetCoagulation factor X
LigandBDBM50228929
Substrate/Competitorn/a
Meas. Tech.ChEMBL_461718 (CHEMBL928849)
Ki 180±n/a nM
Citation Young, RJBorthwick, ADBrown, DBurns-Kurtis, CLCampbell, MChan, CCharbaut, MChung, CWConvery, MAKelly, HAPaul King, NKleanthous, SMason, AMPateman, AJPatikis, ANPinto, ILPollard, DRSenger, SShah, GPToomey, JRWatson, NSWeston, HE Structure and property based design of factor Xa inhibitors: pyrrolidin-2-ones with biaryl P4 motifs. Bioorg Med Chem Lett18:23-7 (2008) 
 
Coagulation factor X
Name:Coagulation factor X
Type:Enzyme
Mol. Mass.:54726.60
Organism:Homo sapiens (Human)
Description:n/a
Residue:488
BDBM50228929
NameBDBM50228929
Synonyms:(E)-2-(5-chlorothiophen-2-yl)-N-(1-(5-(2-isopropoxyphenyl)pyridin-2-yl)-2-oxopyrrolidin-3-yl)ethenesulfonamide | CHEMBL402384
TypeSmall organic molecule
Emp. Form.C24H24ClN3O4S2
Mol. Mass.518.048
SMILESCC(C)Oc1ccccc1-c1ccc(nc1)N1CCC(NS(=O)(=O)\C=C\c2ccc(Cl)s2)C1=O