Reaction Details
TargetCoagulation factor X
LigandBDBM50228942
Substrate/Competitorn/a
Meas. Tech.ChEMBL_461721 (CHEMBL928852)
Ki 2334±n/a nM
Citation Young, RJBorthwick, ADBrown, DBurns-Kurtis, CLCampbell, MChan, CCharbaut, MChung, CWConvery, MAKelly, HAPaul King, NKleanthous, SMason, AMPateman, AJPatikis, ANPinto, ILPollard, DRSenger, SShah, GPToomey, JRWatson, NSWeston, HE Structure and property based design of factor Xa inhibitors: pyrrolidin-2-ones with biaryl P4 motifs. Bioorg Med Chem Lett18:23-7 (2008) 
 
Coagulation factor X
Name:Coagulation factor X
Type:Enzyme
Mol. Mass.:54726.60
Organism:Homo sapiens (Human)
Description:n/a
Residue:488
BDBM50228942
NameBDBM50228942
Synonyms:(E)-N-(1-(5-(2-tert-butylphenyl)pyridin-2-yl)-2-oxopyrrolidin-3-yl)-2-(5-chlorothiophen-2-yl)ethenesulfonamide | CHEMBL254947
TypeSmall organic molecule
Emp. Form.C25H26ClN3O3S2
Mol. Mass.516.075
SMILESCC(C)(C)c1ccccc1-c1ccc(nc1)N1CCC(NS(=O)(=O)\C=C\c2ccc(Cl)s2)C1=O