Reaction Details
TargetCruzipain
LigandBDBM50229122
Substrate/Competitorn/a
Meas. Tech.ChEMBL_461748 (CHEMBL928879)
Ki 170±n/a nM
Citation Jaishankar, PHansell, EZhao, DMDoyle, PSMcKerrow, JHRenslo, AR Potency and selectivity of P2/P3-modified inhibitors of cysteine proteases from trypanosomes. Bioorg Med Chem Lett18:624-8 (2008) 
 
Cruzipain
Name:Cruzipain
Type:Protein
Mol. Mass.:49831.41
Organism:Trypanosoma cruzi
Description:P25779
Residue:467
BDBM50229122
NameBDBM50229122
Synonyms:4-methyl-N-((S)-1-oxo-1-((S)-5-phenyl-1-(phenylsulfonyl)pent-1-en-3-ylamino)-3-(3-(trifluoromethyl)phenyl)propan-2-yl)piperazine-1-carboxamide | CHEMBL254902
TypeSmall organic molecule
Emp. Form.C33H37F3N4O4S
Mol. Mass.642.731
SMILESCN1CCN(CC1)C(=O)N[C@@H](Cc1cccc(c1)C(F)(F)F)C(=O)N[C@@H](CCc1ccccc1)C=CS(=O)(=O)c1ccccc1