Reaction Details
TargetCruzipain
LigandBDBM50229123
Substrate/Competitorn/a
Meas. Tech.ChEMBL_461748 (CHEMBL928879)
Ki 97±n/a nM
Citation Jaishankar, PHansell, EZhao, DMDoyle, PSMcKerrow, JHRenslo, AR Potency and selectivity of P2/P3-modified inhibitors of cysteine proteases from trypanosomes. Bioorg Med Chem Lett18:624-8 (2008) 
 
Cruzipain
Name:Cruzipain
Type:Protein
Mol. Mass.:49831.41
Organism:Trypanosoma cruzi
Description:P25779
Residue:467
BDBM50229123
NameBDBM50229123
Synonyms:CHEMBL254687 | N-((S)-1-oxo-3-phenyl-1-((S)-5-phenyl-1-(phenylsulfonyl)pent-1-en-3-ylamino)propan-2-yl)-4-(trifluoromethyl)benzamide
TypeSmall organic molecule
Emp. Form.C34H31F3N2O4S
Mol. Mass.620.681
SMILESFC(F)(F)c1ccc(cc1)C(=O)N[C@@H](Cc1ccccc1)C(=O)N[C@@H](CCc1ccccc1)\C=C\S(=O)(=O)c1ccccc1