Reaction Details
TargetCruzipain
LigandBDBM50229127
Substrate/Competitorn/a
Meas. Tech.ChEMBL_461748 (CHEMBL928879)
Ki 80±n/a nM
Citation Jaishankar, PHansell, EZhao, DMDoyle, PSMcKerrow, JHRenslo, AR Potency and selectivity of P2/P3-modified inhibitors of cysteine proteases from trypanosomes. Bioorg Med Chem Lett18:624-8 (2008) 
 
Cruzipain
Name:Cruzipain
Type:Protein
Mol. Mass.:49831.41
Organism:Trypanosoma cruzi
Description:P25779
Residue:467
BDBM50229127
NameBDBM50229127
Synonyms:CHEMBL399676 | N-((S)-1-oxo-3-phenyl-1-((S)-5-phenyl-1-(phenylsulfonyl)pent-1-en-3-ylamino)propan-2-yl)-2,3-dihydrobenzo[b][1,4]dioxine-6-carboxamide
TypeSmall organic molecule
Emp. Form.C35H34N2O6S
Mol. Mass.610.719
SMILESO=C(N[C@@H](CCc1ccccc1)\C=C\S(=O)(=O)c1ccccc1)[C@H](Cc1ccccc1)NC(=O)c1ccc2OCCOc2c1