Reaction Details
TargetCruzipain
LigandBDBM50229119
Substrate/Competitorn/a
Meas. Tech.ChEMBL_461748 (CHEMBL928879)
Ki 350±n/a nM
Citation Jaishankar, PHansell, EZhao, DMDoyle, PSMcKerrow, JHRenslo, AR Potency and selectivity of P2/P3-modified inhibitors of cysteine proteases from trypanosomes. Bioorg Med Chem Lett18:624-8 (2008) 
 
Cruzipain
Name:Cruzipain
Type:Protein
Mol. Mass.:49831.41
Organism:Trypanosoma cruzi
Description:P25779
Residue:467
BDBM50229119
NameBDBM50229119
Synonyms:3,5-difluoro-N-((S)-1-oxo-1-((S)-5-phenyl-1-(phenylsulfonyl)pent-1-en-3-ylamino)-3-p-tolylpropan-2-yl)benzamide | CHEMBL251810
TypeSmall organic molecule
Emp. Form.C34H32F2N2O4S
Mol. Mass.602.691
SMILESCc1ccc(C[C@H](NC(=O)c2cc(F)cc(F)c2)C(=O)N[C@@H](CCc2ccccc2)\C=C\S(=O)(=O)c2ccccc2)cc1