Reaction Details
TargetHistone deacetylase 5
LigandBDBM19410
Substrate/Competitorn/a
Meas. Tech.ChEMBL_461759 (CHEMBL927765)
IC50>50000±n/a nM
Citation Witter, DJHarrington, PWilson, KJChenard, MFleming, JCHaines, BKral, AMSecrist, JPMiller, TA Optimization of biaryl Selective HDAC1&2 Inhibitors (SHI-1:2). Bioorg Med Chem Lett18:726-31 (2008) 
 
Histone deacetylase 5
Name:Histone deacetylase 5
Type:Enzyme
Mol. Mass.:121968.61
Organism:Homo sapiens (Human)
Description:Q9UQL6
Residue:1122
BDBM19410
NameBDBM19410
Synonyms:CHEMBL27759 US11377423, MS-275 US9265734, MS-275 benzamide-type inhibitor, 3 | pyridin-3-ylmethyl N-({4-[(2-aminophenyl)carbamoyl]phenyl}methyl)carbamate
TypeSmall organic molecule
Emp. Form.C21H20N4O3
Mol. Mass.376.4085
SMILESNc1ccccc1NC(=O)c1ccc(CNC(=O)OCc2cccnc2)cc1