Reaction Details
TargetHistone deacetylase 1
LigandBDBM50229190
Substrate/Competitorn/a
Meas. Tech.ChEMBL_461755 (CHEMBL927761)
IC50 11±n/a nM
Citation Witter, DJHarrington, PWilson, KJChenard, MFleming, JCHaines, BKral, AMSecrist, JPMiller, TA Optimization of biaryl Selective HDAC1&2 Inhibitors (SHI-1:2). Bioorg Med Chem Lett18:726-31 (2008) 
 
Histone deacetylase 1
Name:Histone deacetylase 1
Type:Enzyme
Mol. Mass.:55090.27
Organism:Homo sapiens (Human)
Description:Q13547
Residue:482
BDBM50229190
NameBDBM50229190
Synonyms:CHEMBL253869 US9096559, 14a | US9096559, 53
TypeSmall organic molecule
Emp. Form.C28H26N4O2
Mol. Mass.450.5316
SMILESNc1ccc(cc1NC(=O)c1ccc(CNC(=O)CCc2cccnc2)cc1)-c1ccccc1