Reaction Details
TargetHistone deacetylase 7
LigandBDBM50229192
Substrate/Competitorn/a
Meas. Tech.ChEMBL_461761 (CHEMBL927767)
IC50>50000±n/a nM
Citation Witter, DJHarrington, PWilson, KJChenard, MFleming, JCHaines, BKral, AMSecrist, JPMiller, TA Optimization of biaryl Selective HDAC1&2 Inhibitors (SHI-1:2). Bioorg Med Chem Lett18:726-31 (2008) 
 
Histone deacetylase 7
Name:Histone deacetylase 7
Type:Chromatin regulator; hydrolase; repressor
Mol. Mass.:102942.62
Organism:Homo sapiens (Human)
Description:Q8WUI4
Residue:952
BDBM50229192
NameBDBM50229192
Synonyms:CHEMBL398420 US9096559, 9 | [4-(4-amino-biphenyl-3-ylcarbamoyl)-benzyl]-carbamic acid methyl ester
TypeSmall organic molecule
Emp. Form.C22H21N3O3
Mol. Mass.375.4204
SMILESCOC(=O)NCc1ccc(cc1)C(=O)Nc1cc(ccc1N)-c1ccccc1