Reaction Details
TargetHistone deacetylase 3
LigandBDBM50229199
Substrate/Competitorn/a
Meas. Tech.ChEMBL_461757 (CHEMBL927763)
IC50 2810±n/a nM
Citation Witter, DJHarrington, PWilson, KJChenard, MFleming, JCHaines, BKral, AMSecrist, JPMiller, TA Optimization of biaryl Selective HDAC1&2 Inhibitors (SHI-1:2). Bioorg Med Chem Lett18:726-31 (2008) 
 
Histone deacetylase 3
Name:Histone deacetylase 3
Type:Enzyme
Mol. Mass.:48829.55
Organism:Homo sapiens (Human)
Description:O15379
Residue:428
BDBM50229199
NameBDBM50229199
Synonyms:CHEMBL398884 | thiophene-2-carboxylic acid (4-hydroxy-biphenyl-3-yl)-amide
TypeSmall organic molecule
Emp. Form.C17H13NO2S
Mol. Mass.295.356
SMILESOc1ccc(cc1NC(=O)c1cccs1)-c1ccccc1