Reaction Details
TargetHistone deacetylase 6
LigandBDBM50229189
Substrate/Competitorn/a
Meas. Tech.ChEMBL_461760 (CHEMBL927766)
IC50>50000±n/a nM
Citation Witter, DJHarrington, PWilson, KJChenard, MFleming, JCHaines, BKral, AMSecrist, JPMiller, TA Optimization of biaryl Selective HDAC1&2 Inhibitors (SHI-1:2). Bioorg Med Chem Lett18:726-31 (2008) 
 
Histone deacetylase 6
Name:Histone deacetylase 6
Type:Chromatin regulator; hydrolase; repressor
Mol. Mass.:131381.51
Organism:Homo sapiens (Human)
Description:Q9UBN7
Residue:1215
BDBM50229189
NameBDBM50229189
Synonyms:CHEMBL253868 [4-(4-amino-biphenyl-3-ylcarbamoyl)-benzyl]-carbamic acid pyridin-3-ylmethyl ester
TypeSmall organic molecule
Emp. Form.C27H24N4O3
Mol. Mass.452.5045
SMILESNc1ccc(cc1NC(=O)c1ccc(CNC(=O)OCc2cccnc2)cc1)-c1ccccc1