Reaction Details
TargetPotassium voltage-gated channel subfamily H member 2
LigandBDBM50229190
Substrate/Competitorn/a
Meas. Tech.ChEMBL_461764 (CHEMBL927770)
IC50 3700±n/a nM
Citation Witter, DJHarrington, PWilson, KJChenard, MFleming, JCHaines, BKral, AMSecrist, JPMiller, TA Optimization of biaryl Selective HDAC1&2 Inhibitors (SHI-1:2). Bioorg Med Chem Lett18:726-31 (2008) 
 
Potassium voltage-gated channel subfamily H member 2
Name:Potassium voltage-gated channel subfamily H member 2
Type:Multi-pass membrane protein
Mol. Mass.:126672.65
Organism:Homo sapiens (Human)
Description:Q12809
Residue:1159
BDBM50229190
NameBDBM50229190
Synonyms:CHEMBL253869 US9096559, 14a | US9096559, 53
TypeSmall organic molecule
Emp. Form.C28H26N4O2
Mol. Mass.450.5316
SMILESNc1ccc(cc1NC(=O)c1ccc(CNC(=O)CCc2cccnc2)cc1)-c1ccccc1