Reaction Details
TargetHistone deacetylase 4
LigandBDBM50229197
Substrate/Competitorn/a
Meas. Tech.ChEMBL_461758 (CHEMBL927764)
IC50>50000±n/a nM
Citation Witter, DJHarrington, PWilson, KJChenard, MFleming, JCHaines, BKral, AMSecrist, JPMiller, TA Optimization of biaryl Selective HDAC1&2 Inhibitors (SHI-1:2). Bioorg Med Chem Lett18:726-31 (2008) 
 
Histone deacetylase 4
Name:Histone deacetylase 4
Type:Enzyme
Mol. Mass.:119049.39
Organism:Homo sapiens (Human)
Description:P56524
Residue:1084
BDBM50229197
NameBDBM50229197
Synonyms:CHEMBL399494 ethyl 4-((2-amino-5-(thiophen-2-yl)phenyl)carbamoyl)benzylcarbamate
TypeSmall organic molecule
Emp. Form.C21H21N3O3S
Mol. Mass.395.475
SMILESCCOC(=O)NCc1ccc(cc1)C(=O)Nc1cc(ccc1N)-c1cccs1