Reaction Details
TargetPeroxisome proliferator-activated receptor gamma
LigandBDBM50229208
Substrate/Competitorn/a
Meas. Tech.ChEMBL_461779 (CHEMBL927785)
EC50 300±n/a nM
Citation Faucher, NMartres, PLaroze, APineau, OPotvain, FGrillot, D Design, synthesis and evaluation of trifluoromethane sulfonamide derivatives as new potent and selective peroxisome proliferator-activated receptor alpha agonists. Bioorg Med Chem Lett18:710-5 (2008) 
 
Peroxisome proliferator-activated receptor gamma
Name:Peroxisome proliferator-activated receptor gamma
Type:Nuclear Receptor
Mol. Mass.:57613.46
Organism:Homo sapiens (Human)
Description:P37231
Residue:505
BDBM50229208
NameBDBM50229208
Synonyms:CHEMBL427890 | N-(4-(2,2,2-trifluoroethylsulfonamido)benzyl)-4-methyl-2-(4-(trifluoromethyl)phenyl)thiazole-5-carboxamide
TypeSmall organic molecule
Emp. Form.C21H17F6N3O3S2
Mol. Mass.537.498
SMILESCc1nc(sc1C(=O)NCc1ccc(NS(=O)(=O)CC(F)(F)F)cc1)-c1ccc(cc1)C(F)(F)F