Reaction Details
TargetPeroxisome proliferator-activated receptor delta
LigandBDBM50229209
Substrate/Competitorn/a
Meas. Tech.ChEMBL_461777 (CHEMBL927783)
EC50>10000±n/a nM
Citation Faucher, NMartres, PLaroze, APineau, OPotvain, FGrillot, D Design, synthesis and evaluation of trifluoromethane sulfonamide derivatives as new potent and selective peroxisome proliferator-activated receptor alpha agonists. Bioorg Med Chem Lett18:710-5 (2008) 
 
Peroxisome proliferator-activated receptor delta
Name:Peroxisome proliferator-activated receptor delta
Type:PROTEIN
Mol. Mass.:49719.14
Organism:Mus musculus
Description:ChEMBL_1288931
Residue:440
BDBM50229209
NameBDBM50229209
Synonyms:CHEMBL404467 | N-(4-(4-methylphenylsulfonamido)benzyl)-4-methyl-2-(4-(trifluoromethyl)phenyl)thiazole-5-carboxamide
TypeSmall organic molecule
Emp. Form.C26H22F3N3O3S2
Mol. Mass.545.596
SMILESCc1nc(sc1C(=O)NCc1ccc(NS(=O)(=O)c2ccc(C)cc2)cc1)-c1ccc(cc1)C(F)(F)F