Reaction Details
TargetPeroxisome proliferator-activated receptor delta
LigandBDBM50229212
Substrate/Competitorn/a
Meas. Tech.ChEMBL_461775 (CHEMBL927781)
EC50>10000±n/a nM
Citation Faucher, NMartres, PLaroze, APineau, OPotvain, FGrillot, D Design, synthesis and evaluation of trifluoromethane sulfonamide derivatives as new potent and selective peroxisome proliferator-activated receptor alpha agonists. Bioorg Med Chem Lett18:710-5 (2008) 
 
Peroxisome proliferator-activated receptor delta
Name:Peroxisome proliferator-activated receptor delta
Type:Enzyme
Mol. Mass.:49910.45
Organism:Homo sapiens (Human)
Description:Q03181
Residue:441
BDBM50229212
NameBDBM50229212
Synonyms:CHEMBL254946 | N-(4-(propan-2-ylsulfonamido)benzyl)-4-methyl-2-(4-(trifluoromethyl)phenyl)thiazole-5-carboxamide
TypeSmall organic molecule
Emp. Form.C22H22F3N3O3S2
Mol. Mass.497.554
SMILESCC(C)S(=O)(=O)Nc1ccc(CNC(=O)c2sc(nc2C)-c2ccc(cc2)C(F)(F)F)cc1