Reaction Details
TargetPeroxisome proliferator-activated receptor alpha
LigandBDBM50229217
Substrate/Competitorn/a
Meas. Tech.ChEMBL_461773 (CHEMBL927779)
EC50 450±n/a nM
Citation Faucher, NMartres, PLaroze, APineau, OPotvain, FGrillot, D Design, synthesis and evaluation of trifluoromethane sulfonamide derivatives as new potent and selective peroxisome proliferator-activated receptor alpha agonists. Bioorg Med Chem Lett18:710-5 (2008) 
 
Peroxisome proliferator-activated receptor alpha
Name:Peroxisome proliferator-activated receptor alpha
Type:Enzyme
Mol. Mass.:52222.08
Organism:Homo sapiens (Human)
Description:Q07869
Residue:468
BDBM50229217
NameBDBM50229217
Synonyms:CHEMBL402100 | N-(4-(2,2,2-trifluoroacetamido)benzyl)-4-methyl-2-(4-(trifluoromethyl)phenyl)thiazole-5-carboxamide
TypeSmall organic molecule
Emp. Form.C21H15F6N3O2S
Mol. Mass.487.418
SMILESCc1nc(sc1C(=O)NCc1ccc(NC(=O)C(F)(F)F)cc1)-c1ccc(cc1)C(F)(F)F