Reaction Details
TargetPeroxisome proliferator-activated receptor delta
LigandBDBM50229205
Substrate/Competitorn/a
Meas. Tech.ChEMBL_461775 (CHEMBL927781)
EC50>10000±n/a nM
Citation Faucher, NMartres, PLaroze, APineau, OPotvain, FGrillot, D Design, synthesis and evaluation of trifluoromethane sulfonamide derivatives as new potent and selective peroxisome proliferator-activated receptor alpha agonists. Bioorg Med Chem Lett18:710-5 (2008) 
 
Peroxisome proliferator-activated receptor delta
Name:Peroxisome proliferator-activated receptor delta
Type:Enzyme
Mol. Mass.:49910.45
Organism:Homo sapiens (Human)
Description:Q03181
Residue:441
BDBM50229205
NameBDBM50229205
Synonyms:CHEMBL253520 | N-(4-((trifluoromethylsulfonamido)methyl)benzyl)-4-methyl-2-(4-(trifluoromethyl)phenyl)thiazole-5-carboxamide
TypeSmall organic molecule
Emp. Form.C21H17F6N3O3S2
Mol. Mass.537.498
SMILESCc1nc(sc1C(=O)NCc1ccc(CNS(=O)(=O)C(F)(F)F)cc1)-c1ccc(cc1)C(F)(F)F