Reaction Details
TargetC-X-C chemokine receptor type 3
LigandBDBM50211114
Substrate/Competitorn/a
Meas. Tech.ChEMBL_461818 (CHEMBL928947)
IC50 36±n/a nM
Citation Li, ARJohnson, MGLiu, JChen, XDu, XMihalic, JTDeignan, JGustin, DJDuquette, JFu, ZZhu, LMarcus, APBergeron, PMcGee, LRDanao, JLemon, BCarabeo, TSullivan, TMa, JTang, LTonn, GCollins, TLMedina, JC Optimization of the heterocyclic core of the quinazolinone-derived CXCR3 antagonists. Bioorg Med Chem Lett18:688-93 (2008) 
 
C-X-C chemokine receptor type 3
Name:C-X-C chemokine receptor type 3
Type:Enzyme Catalytic Domain
Mol. Mass.:40665.65
Organism:Homo sapiens (Human)
Description:n/a
Residue:368
BDBM50211114
NameBDBM50211114
Synonyms:(-)-(R)-N-(1-(3-(4-ethoxyphenyl)-4-oxo-3,4-dihydropyrido[2,3-d]pyrimidin-2-yl)ethyl)-N-(pyridin-3-ylmethyl)-2-(4-(trifluoromethoxy)phenyl)acetamide AMG-487 | CHEMBL397983
TypeSmall organic molecule
Emp. Form.C32H28F3N5O4
Mol. Mass.603.591
SMILESCCOc1ccc(cc1)-n1c(nc2ncccc2c1=O)[C@@H](C)N(Cc1cccnc1)C(=O)Cc1ccc(OC(F)(F)F)cc1