Reaction Details
TargetC-X-C chemokine receptor type 3
LigandBDBM50229384
Substrate/Competitorn/a
Meas. Tech.ChEMBL_461808 (CHEMBL928937)
IC50 5±n/a nM
Citation Li, ARJohnson, MGLiu, JChen, XDu, XMihalic, JTDeignan, JGustin, DJDuquette, JFu, ZZhu, LMarcus, APBergeron, PMcGee, LRDanao, JLemon, BCarabeo, TSullivan, TMa, JTang, LTonn, GCollins, TLMedina, JC Optimization of the heterocyclic core of the quinazolinone-derived CXCR3 antagonists. Bioorg Med Chem Lett18:688-93 (2008) 
 
C-X-C chemokine receptor type 3
Name:C-X-C chemokine receptor type 3
Type:Enzyme Catalytic Domain
Mol. Mass.:40665.65
Organism:Homo sapiens (Human)
Description:n/a
Residue:368
BDBM50229384
NameBDBM50229384
Synonyms:(R)-N-(1-(2-(4-cyanophenyl)quinolin-3-yl)ethyl)-N-(2-(ethylsulfonyl)ethyl)-2-(4-fluoro-3-(trifluoromethyl)phenyl)acetamide | CHEMBL399084
TypeSmall organic molecule
Emp. Form.C31H27F4N3O3S
Mol. Mass.597.623
SMILESCCS(=O)(=O)CCN([C@H](C)c1cc2ccccc2nc1-c1ccc(cc1)C#N)C(=O)Cc1ccc(F)c(c1)C(F)(F)F