Reaction Details
TargetKappa-type opioid receptor
LigandBDBM50229594
Substrate/Competitorn/a
Meas. Tech.ChEMBL_460135 (CHEMBL924982)
Ki 2200±n/a nM
Citation Briard, EZoghbi, SSImaizumi, MGourley, JPShetty, HUHong, JCropley, VFujita, MInnis, RBPike, VW Synthesis and evaluation in monkey of two sensitive 11C-labeled aryloxyanilide ligands for imaging brain peripheral benzodiazepine receptors in vivo. J Med Chem51:17-30 (2008) 
 
Kappa-type opioid receptor
Name:Kappa-type opioid receptor
Type:G Protein-Coupled Receptor (GPCR)
Mol. Mass.:42648.76
Organism:Homo sapiens (Human)
Description:P41145
Residue:380
BDBM50229594
NameBDBM50229594
Synonyms:CHEMBL253597 | N-(2-methoxybenzyl)-N-(4-phenoxypyridin-3-yl)acetamide
TypeSmall organic molecule
Emp. Form.C21H20N2O3
Mol. Mass.348.3951
SMILESCOc1ccccc1CN(C(C)=O)c1cnccc1Oc1ccccc1