Reaction Details
Target72 kDa type IV collagenase
LigandBDBM50229641
Substrate/Competitorn/a
Meas. Tech.ChEMBL_461864 (CHEMBL927857)
IC50>2000±n/a nM
Citation Burns, DMHe, CLi, YScherle, PLiu, XMarando, CACovington, MBYang, GPan, MTurner, SFridman, JSHollis, GVaddi, KYeleswaram, SNewton, RFriedman, SMetcalf, BYao, W Conversion of an MMP-potent scaffold to an MMP-selective HER-2 sheddase inhibitor via scaffold hybridization and subtle P1' permutations. Bioorg Med Chem Lett18:560-4 (2008) 
 
72 kDa type IV collagenase
Name:72 kDa type IV collagenase
Type:Enzyme
Mol. Mass.:73870.36
Organism:Homo sapiens (Human)
Description: P08253
Residue:660
BDBM50229641
NameBDBM50229641
Synonyms:CHEMBL400528 | pyrrolidin-3-yl 4-((4-(4-cyano-2-methylphenyl)piperidin-1-ylsulfonyl)methyl)-4-(hydroxycarbamoyl)piperidine-1-carboxylate
TypeSmall organic molecule
Emp. Form.C25H35N5O6S
Mol. Mass.533.64
SMILESCc1cc(ccc1C1CCN(CC1)S(=O)(=O)CC1(CCN(CC1)C(=O)OC1CCNC1)C(=O)NO)C#N