Reaction Details
TargetInterstitial collagenase
LigandBDBM50229651
Substrate/Competitorn/a
Meas. Tech.ChEMBL_461863 (CHEMBL927856)
IC50>5000±n/a nM
Citation Burns, DMHe, CLi, YScherle, PLiu, XMarando, CACovington, MBYang, GPan, MTurner, SFridman, JSHollis, GVaddi, KYeleswaram, SNewton, RFriedman, SMetcalf, BYao, W Conversion of an MMP-potent scaffold to an MMP-selective HER-2 sheddase inhibitor via scaffold hybridization and subtle P1' permutations. Bioorg Med Chem Lett18:560-4 (2008) 
 
Interstitial collagenase
Name:Interstitial collagenase
Type:Enzyme
Mol. Mass.:54010.26
Organism:Homo sapiens (Human)
Description: P03956
Residue:469
BDBM50229651
NameBDBM50229651
Synonyms:(S)-pyrrolidin-2-ylmethyl 4-((4-(4-cyano-2-methylphenyl)piperidin-1-ylsulfonyl)methyl)-4-(hydroxycarbamoyl)piperidine-1-carboxylate | CHEMBL253021
TypeSmall organic molecule
Emp. Form.C26H37N5O6S
Mol. Mass.547.667
SMILESCc1cc(ccc1C1CCN(CC1)S(=O)(=O)CC1(CCN(CC1)C(=O)OC[C@@H]1CCCN1)C(=O)NO)C#N