Reaction Details
TargetDisintegrin and metalloproteinase domain-containing protein 10
LigandBDBM50229660
Substrate/Competitorn/a
Meas. Tech.ChEMBL_461862 (CHEMBL927855)
IC50 11±n/a nM
Citation Burns, DMHe, CLi, YScherle, PLiu, XMarando, CACovington, MBYang, GPan, MTurner, SFridman, JSHollis, GVaddi, KYeleswaram, SNewton, RFriedman, SMetcalf, BYao, W Conversion of an MMP-potent scaffold to an MMP-selective HER-2 sheddase inhibitor via scaffold hybridization and subtle P1' permutations. Bioorg Med Chem Lett18:560-4 (2008) 
 
Disintegrin and metalloproteinase domain-containing protein 10
Name:Disintegrin and metalloproteinase domain-containing protein 10
Type:Enzyme
Mol. Mass.:84160.93
Organism:Homo sapiens (Human)
Description:O14672
Residue:748
BDBM50229660
NameBDBM50229660
Synonyms:3-methyl-tetrahydrofuran-3-yl 4-(hydroxycarbamoyl)-4-((4-o-tolylpiperidin-1-ylsulfonyl)methyl)piperidine-1-carboxylate | CHEMBL254492
TypeSmall organic molecule
Emp. Form.C25H37N3O7S
Mol. Mass.523.642
SMILESCc1ccccc1C1CCN(CC1)S(=O)(=O)CC1(CCN(CC1)C(=O)OC1(C)CCOC1)C(=O)NO