Reaction Details
TargetDisintegrin and metalloproteinase domain-containing protein 10
LigandBDBM50229647
Substrate/Competitorn/a
Meas. Tech.ChEMBL_461861 (CHEMBL927854)
IC50 19±n/a nM
Citation Burns, DMHe, CLi, YScherle, PLiu, XMarando, CACovington, MBYang, GPan, MTurner, SFridman, JSHollis, GVaddi, KYeleswaram, SNewton, RFriedman, SMetcalf, BYao, W Conversion of an MMP-potent scaffold to an MMP-selective HER-2 sheddase inhibitor via scaffold hybridization and subtle P1' permutations. Bioorg Med Chem Lett18:560-4 (2008) 
 
Disintegrin and metalloproteinase domain-containing protein 10
Name:Disintegrin and metalloproteinase domain-containing protein 10
Type:Enzyme
Mol. Mass.:84160.93
Organism:Homo sapiens (Human)
Description:O14672
Residue:748
BDBM50229647
NameBDBM50229647
Synonyms:(R)-pyrrolidin-2-ylmethyl 4-((4-(4-cyano-2-methylphenyl)-5,6-dihydropyridin-1(2H)-ylsulfonyl)methyl)-4-(hydroxycarbamoyl)piperidine-1-carboxylate | CHEMBL398743
TypeSmall organic molecule
Emp. Form.C26H35N5O6S
Mol. Mass.545.651
SMILESCc1cc(ccc1C1=CCN(CC1)S(=O)(=O)CC1(CCN(CC1)C(=O)OC[C@H]1CCCN1)C(=O)NO)C#N