Reaction Details
TargetDisintegrin and metalloproteinase domain-containing protein 10
LigandBDBM50229651
Substrate/Competitorn/a
Meas. Tech.ChEMBL_461861 (CHEMBL927854)
IC50 6.5±n/a nM
Citation Burns, DMHe, CLi, YScherle, PLiu, XMarando, CACovington, MBYang, GPan, MTurner, SFridman, JSHollis, GVaddi, KYeleswaram, SNewton, RFriedman, SMetcalf, BYao, W Conversion of an MMP-potent scaffold to an MMP-selective HER-2 sheddase inhibitor via scaffold hybridization and subtle P1' permutations. Bioorg Med Chem Lett18:560-4 (2008) 
 
Disintegrin and metalloproteinase domain-containing protein 10
Name:Disintegrin and metalloproteinase domain-containing protein 10
Type:Enzyme
Mol. Mass.:84160.93
Organism:Homo sapiens (Human)
Description:O14672
Residue:748
BDBM50229651
NameBDBM50229651
Synonyms:(S)-pyrrolidin-2-ylmethyl 4-((4-(4-cyano-2-methylphenyl)piperidin-1-ylsulfonyl)methyl)-4-(hydroxycarbamoyl)piperidine-1-carboxylate | CHEMBL253021
TypeSmall organic molecule
Emp. Form.C26H37N5O6S
Mol. Mass.547.667
SMILESCc1cc(ccc1C1CCN(CC1)S(=O)(=O)CC1(CCN(CC1)C(=O)OC[C@@H]1CCCN1)C(=O)NO)C#N