Reaction Details
TargetProtein kinase C theta type
LigandBDBM50229772
Substrate/Competitorn/a
Meas. Tech.ChEMBL_460216 (CHEMBL927266)
Ki 1.4±n/a nM
Citation Yanagita, RCNakagawa, YYamanaka, NKashiwagi, KSaito, NIrie, K Synthesis, conformational analysis, and biological evaluation of 1-hexylindolactam-V10 as a selective activator for novel protein kinase C isozymes. J Med Chem51:46-56 (2008) 
 
Protein kinase C theta type
Name:Protein kinase C theta type
Type:Serine/threonine-protein kinase
Mol. Mass.:81878.04
Organism:Homo sapiens (Human)
Description:Full-length human PKC theta (Panvera Catalog No. P2996).
Residue:706
BDBM50229772
NameBDBM50229772
Synonyms:1-hexylindolactam-V | CHEMBL399981
TypeSmall organic molecule
Emp. Form.C23H35N3O2
Mol. Mass.385.5429
SMILESCCCCCCn1cc2C[C@@H](CO)NC(=O)[C@H](C(C)C)N(C)c3cccc1c23