Reaction Details
TargetMatrix metalloproteinase-9
LigandBDBM50230510
Substrate/Competitorn/a
Meas. Tech.ChEMBL_461907 (CHEMBL944754)
IC50 5.4±n/a nM
Citation Yang, SMScannevin, RHWang, BBurke, SLHuang, ZKarnachi, PWilson, LJRhodes, KJLagu, BMurray, WV beta-N-Biaryl ether sulfonamide hydroxamates as potent gelatinase inhibitors: part 2. Optimization of alpha-amino substituents. Bioorg Med Chem Lett18:1140-5 (2008) 
 
Matrix metalloproteinase-9
Name:Matrix metalloproteinase-9
Type:Enzyme
Mol. Mass.:78452.28
Organism:Homo sapiens (Human)
Description:P14780
Residue:707
BDBM50230510
NameBDBM50230510
Synonyms:CHEMBL252022 | N-{(S)-1-hydroxycarbamoyl-2-[methanesulfonyl-(4-p-tolyloxy-phenyl)-amino]-ethyl}-isobutyramide
TypeSmall organic molecule
Emp. Form.C21H27N3O6S
Mol. Mass.449.521
SMILESCC(C)C(=O)N[C@@H](CN(c1ccc(Oc2ccc(C)cc2)cc1)S(C)(=O)=O)C(=O)NO