Reaction Details
TargetMatrix metalloproteinase-9
LigandBDBM50230515
Substrate/Competitorn/a
Meas. Tech.ChEMBL_461907 (CHEMBL944754)
IC50 1.7±n/a nM
Citation Yang, SMScannevin, RHWang, BBurke, SLHuang, ZKarnachi, PWilson, LJRhodes, KJLagu, BMurray, WV beta-N-Biaryl ether sulfonamide hydroxamates as potent gelatinase inhibitors: part 2. Optimization of alpha-amino substituents. Bioorg Med Chem Lett18:1140-5 (2008) 
 
Matrix metalloproteinase-9
Name:Matrix metalloproteinase-9
Type:Enzyme
Mol. Mass.:78452.28
Organism:Homo sapiens (Human)
Description:P14780
Residue:707
BDBM50230515
NameBDBM50230515
Synonyms:(S)-2-(1,1-dioxo-1lambda*6*-thiomorpholin-4-yl)-N-hydroxy-3-{methanesulfonyl-[4-(4-trifluoromethyl-phenoxy)-phenyl]-amino}-propionamide | CHEMBL429123
TypeSmall organic molecule
Emp. Form.C21H24F3N3O7S2
Mol. Mass.551.556
SMILESCS(=O)(=O)N(C[C@H](N1CCS(=O)(=O)CC1)C(=O)NO)c1ccc(Oc2ccc(cc2)C(F)(F)F)cc1