Reaction Details
TargetMatrix metalloproteinase-9
LigandBDBM11551
Substrate/Competitorn/a
Meas. Tech.ChEMBL_461907 (CHEMBL944754)
Ki 0.900000±n/a nM
Citation Yang, SMScannevin, RHWang, BBurke, SLHuang, ZKarnachi, PWilson, LJRhodes, KJLagu, BMurray, WV beta-N-Biaryl ether sulfonamide hydroxamates as potent gelatinase inhibitors: part 2. Optimization of alpha-amino substituents. Bioorg Med Chem Lett18:1140-5 (2008) 
 
Matrix metalloproteinase-9
Name:Matrix metalloproteinase-9
Type:Enzyme
Mol. Mass.:78452.28
Organism:Homo sapiens (Human)
Description:P14780
Residue:707
BDBM11551
NameBDBM11551
Synonyms:(3R)-N-hydroxy-2-[(4-methoxy-1,1-biphenyl-4-yl)methyl]-1,2-thiazinane-3-carboxamide 1,1-dioxide CHEMBL103418 | Sultam Hydroxamate 23a
TypeSmall organic molecule
Emp. Form.C19H22N2O5S
Mol. Mass.390.453
SMILESCOc1ccc(cc1)-c1ccc(CN2[C@H](CCCS2(=O)=O)C(=O)NO)cc1