Reaction Details
Target72 kDa type IV collagenase
LigandBDBM50230523
Substrate/Competitorn/a
Meas. Tech.ChEMBL_461906 (CHEMBL944753)
IC50 7.6±n/a nM
Citation Yang, SMScannevin, RHWang, BBurke, SLHuang, ZKarnachi, PWilson, LJRhodes, KJLagu, BMurray, WV beta-N-Biaryl ether sulfonamide hydroxamates as potent gelatinase inhibitors: part 2. Optimization of alpha-amino substituents. Bioorg Med Chem Lett18:1140-5 (2008) 
 
72 kDa type IV collagenase
Name:72 kDa type IV collagenase
Type:Enzyme
Mol. Mass.:73870.36
Organism:Homo sapiens (Human)
Description: P08253
Residue:660
BDBM50230523
NameBDBM50230523
Synonyms:(S)-N-hydroxy-2-(piperidin-1-yl)-3-(N-(4-(4-(trifluoromethyl)phenoxy)phenyl)methan-2-ylsulfonamido)propanamide | CHEMBL253892
TypeSmall organic molecule
Emp. Form.C22H26F3N3O5S
Mol. Mass.501.519
SMILESCS(=O)(=O)N(C[C@H](N1CCCCC1)C(=O)NO)c1ccc(Oc2ccc(cc2)C(F)(F)F)cc1