Reaction Details
Target72 kDa type IV collagenase
LigandBDBM50230512
Substrate/Competitorn/a
Meas. Tech.ChEMBL_461906 (CHEMBL944753)
IC50 2.8±n/a nM
Citation Yang, SMScannevin, RHWang, BBurke, SLHuang, ZKarnachi, PWilson, LJRhodes, KJLagu, BMurray, WV beta-N-Biaryl ether sulfonamide hydroxamates as potent gelatinase inhibitors: part 2. Optimization of alpha-amino substituents. Bioorg Med Chem Lett18:1140-5 (2008) 
 
72 kDa type IV collagenase
Name:72 kDa type IV collagenase
Type:Enzyme
Mol. Mass.:73870.36
Organism:Homo sapiens (Human)
Description: P08253
Residue:660
BDBM50230512
NameBDBM50230512
Synonyms:(S)-2-(cis-2,6-dimethylmorpholino)-N-hydroxy-3-(N-(4-(p-tolyloxy)phenyl)methan-2-ylsulfonamido)propanamide | CHEMBL251831
TypeSmall organic molecule
Emp. Form.C23H31N3O6S
Mol. Mass.477.574
SMILESC[C@H]1CN(C[C@@H](C)O1)[C@@H](CN(c1ccc(Oc2ccc(C)cc2)cc1)S(C)(=O)=O)C(=O)NO