Reaction Details
TargetSodium-dependent serotonin transporter
LigandBDBM50164465
Substrate/Competitorn/a
Meas. Tech.ChEMBL_460400 (CHEMBL927452)
Ki 0.57±n/a nM
Citation Jarkas, NVoll, RJWilliams, LVotaw, JROwens, MGoodman, MM Synthesis and in vivo evaluation of halogenated N,N-dimethyl-2-(2'-amino-4'-hydroxymethylphenylthio)benzylamine derivatives as PET serotonin transporter ligands. J Med Chem51:271-81 (2008) 
 
Sodium-dependent serotonin transporter
Name:Sodium-dependent serotonin transporter
Type:Multi-pass membrane protein
Mol. Mass.:70322.51
Organism:Homo sapiens (Human)
Description:P31645
Residue:630
BDBM50164465
NameBDBM50164465
Synonyms:CHEMBL190937 [3-Amino-4-(2-dimethylaminomethyl-phenylsulfanyl)-phenyl]-methanol
TypeSmall organic molecule
Emp. Form.C16H20N2OS
Mol. Mass.288.408
SMILESCN(C)Cc1ccccc1Sc1ccc(CO)cc1N