Reaction Details
TargetSodium-dependent serotonin transporter
LigandBDBM50230708
Substrate/Competitorn/a
Meas. Tech.ChEMBL_460400 (CHEMBL927452)
Ki 0.29±n/a nM
Citation Jarkas, NVoll, RJWilliams, LVotaw, JROwens, MGoodman, MM Synthesis and in vivo evaluation of halogenated N,N-dimethyl-2-(2'-amino-4'-hydroxymethylphenylthio)benzylamine derivatives as PET serotonin transporter ligands. J Med Chem51:271-81 (2008) 
 
Sodium-dependent serotonin transporter
Name:Sodium-dependent serotonin transporter
Type:Multi-pass membrane protein
Mol. Mass.:70322.51
Organism:Homo sapiens (Human)
Description:P31645
Residue:630
BDBM50230708
NameBDBM50230708
Synonyms:CHEMBL253184 | N,N-dimethyl-2-(2'-amino-4'-hydroxymethyl-phenylthio)-5-bromobenzylamine
TypeSmall organic molecule
Emp. Form.C16H19BrN2OS
Mol. Mass.367.304
SMILESCN(C)Cc1cc(Br)ccc1Sc1ccc(CO)cc1N