Reaction Details
TargetCoagulation factor X
LigandBDBM50231269
Substrate/Competitorn/a
Meas. Tech.ChEMBL_460575 (CHEMBL926651)
Ki 22.9±n/a nM
Citation Lee, YKParks, DJLu, TThieu, TVMarkotan, TPan, WMcComsey, DFMilkiewicz, KLCrysler, CSNinan, NAbad, MCGiardino, ECMaryanoff, BEDamiano, BPPlayer, MR 7-fluoroindazoles as potent and selective inhibitors of factor Xa. J Med Chem51:282-97 (2008) 
 
Coagulation factor X
Name:Coagulation factor X
Type:Enzyme
Mol. Mass.:54726.60
Organism:Homo sapiens (Human)
Description:n/a
Residue:488
BDBM50231269
NameBDBM50231269
Synonyms:1-{4-[1-(3-aminobenzo[d]isoxazol-5-yl)-7-fluoro-3-trifluoromethyl-1H-indazol-6-yl]-3-fluorophenyl}piperidin-2-one | CHEMBL254621
TypeSmall organic molecule
Emp. Form.C26H18F5N5O2
Mol. Mass.527.4454
SMILESNc1noc2ccc(cc12)-n1nc(c2ccc(c(F)c12)-c1ccc(cc1F)N1CCCCC1=O)C(F)(F)F