Reaction Details
TargetC-C chemokine receptor type 3
LigandBDBM50231354
Substrate/Competitorn/a
Meas. Tech.ChEMBL_461963 (CHEMBL945751)
IC50 0.2±n/a nM
Citation Gardner, DSSantella, JBTebben, AJBatt, DGKo, SSTraeger, SCWelch, PKWadman, EADavies, PCarter, PHDuncia, JV From rigid cyclic templates to conformationally stabilized acyclic scaffolds. Part II: Acyclic replacements for the (3S)-3-benzylpiperidine in a series of potent CCR3 antagonists. Bioorg Med Chem Lett18:586-95 (2008) 
 
C-C chemokine receptor type 3
Name:C-C chemokine receptor type 3
Type:Enzyme
Mol. Mass.:41053.88
Organism:Homo sapiens (Human)
Description:P51677
Residue:355
BDBM50231354
NameBDBM50231354
Synonyms:1-((2R,3S)-4-(ethyl((S)-4-(4-fluorophenyl)butan-2-yl)amino)-3-hydroxybutan-2-yl)-3-(3-ethyl-5-(1-methyl-1H-tetrazol-5-yl)phenyl)urea | CHEMBL254095
TypeSmall organic molecule
Emp. Form.C27H38FN7O2
Mol. Mass.511.6347
SMILESCCN(C[C@H](O)[C@@H](C)NC(=O)Nc1cc(CC)cc(c1)-c1nnnn1C)[C@@H](C)CCc1ccc(F)cc1