Reaction Details
TargetC-C chemokine receptor type 3
LigandBDBM50231371
Substrate/Competitorn/a
Meas. Tech.ChEMBL_461963 (CHEMBL945751)
IC50 0.2±n/a nM
Citation Gardner, DSSantella, JBTebben, AJBatt, DGKo, SSTraeger, SCWelch, PKWadman, EADavies, PCarter, PHDuncia, JV From rigid cyclic templates to conformationally stabilized acyclic scaffolds. Part II: Acyclic replacements for the (3S)-3-benzylpiperidine in a series of potent CCR3 antagonists. Bioorg Med Chem Lett18:586-95 (2008) 
 
C-C chemokine receptor type 3
Name:C-C chemokine receptor type 3
Type:Enzyme
Mol. Mass.:41053.88
Organism:Homo sapiens (Human)
Description:P51677
Residue:355
BDBM50231371
NameBDBM50231371
Synonyms:1-((2R,3S)-4-(ethyl(3-(4-fluorophenyl)propyl)amino)-3-hydroxybutan-2-yl)-3-(3-(1-methyl-1H-tetrazol-5-yl)phenyl)urea | CHEMBL251837
TypeSmall organic molecule
Emp. Form.C24H32FN7O2
Mol. Mass.469.555
SMILESCCN(CCCc1ccc(F)cc1)C[C@H](O)[C@@H](C)NC(=O)Nc1cccc(c1)-c1nnnn1C