Reaction Details
Target5-hydroxytryptamine receptor 2A
LigandBDBM50048803
Substrate/Competitorn/a
Meas. Tech.ChEMBL_461981 (CHEMBL945769)
Ki 0.08±n/a nM
Citation Graham, JMCoughenour, LLBarr, BMRock, DLNikam, SS 1-Aminoindanes as novel motif with potential atypical antipsychotic properties. Bioorg Med Chem Lett18:489-93 (2008) 
 
5-hydroxytryptamine receptor 2A
Name:5-hydroxytryptamine receptor 2A
Type:undefined
Mol. Mass.:52607.65
Organism:Homo sapiens (Human)
Description:P28223
Residue:471
BDBM50048803
NameBDBM50048803
Synonyms:5-(2-(4-(benzo[d]isothiazol-3-yl)piperazin-1-yl)ethyl)-6-chloroindolin-2-one 5-[2-(4-Benzo[d]isothiazol-3-yl-piperazin-1-yl)-ethyl]-6-chloro-1,3-dihydro-indol-2-one (Ziprasidone) CHEMBL708 ZIPRASIDONE | ZIPRASIDONE HYDROCHLORIDE
TypeSmall organic molecule
Emp. Form.C21H21ClN4OS
Mol. Mass.412.936
SMILESClc1cc2NC(=O)Cc2cc1CCN1CCN(CC1)c1nsc2ccccc12