Reaction Details
Target5-hydroxytryptamine receptor 2A
LigandBDBM50231453
Substrate/Competitorn/a
Meas. Tech.ChEMBL_461981 (CHEMBL945769)
Ki 0.09±n/a nM
Citation Graham, JMCoughenour, LLBarr, BMRock, DLNikam, SS 1-Aminoindanes as novel motif with potential atypical antipsychotic properties. Bioorg Med Chem Lett18:489-93 (2008) 
 
5-hydroxytryptamine receptor 2A
Name:5-hydroxytryptamine receptor 2A
Type:undefined
Mol. Mass.:52607.65
Organism:Homo sapiens (Human)
Description:P28223
Residue:471
BDBM50231453
NameBDBM50231453
Synonyms:6-(2-(4-(benzo[d]isothiazol-3-yl)piperazin-1-yl)ethyl)-2,3-dihydro-1H-inden-1-amine | CHEMBL404000
TypeSmall organic molecule
Emp. Form.C22H26N4S
Mol. Mass.378.534
SMILESNC1CCc2ccc(CCN3CCN(CC3)c3nsc4ccccc34)cc12