Reaction Details
TargetBeta-2 adrenergic receptor
LigandBDBM50231889
Substrate/Competitorn/a
Meas. Tech.ChEMBL_462093 (CHEMBL944925)
IC50 280000±n/a nM
Citation Mayasundari, AFerreira, AMHe, LMahindroo, NBashford, DFujii, N Rational design of the first small-molecule antagonists of NHERF1/EBP50 PDZ domains. Bioorg Med Chem Lett18:942-5 (2008) 
 
Beta-2 adrenergic receptor
Name:Beta-2 adrenergic receptor
Type:n/a
Mol. Mass.:46461.69
Organism:Homo sapiens (Human)
Description:P07550
Residue:413
BDBM50231889
NameBDBM50231889
Synonyms:3-(hydroxymethyl)-5-methyl-2-pentyl-1-phenethyl-1H-indole-6-carboxylic acid | CHEMBL250740
TypeSmall organic molecule
Emp. Form.C24H29NO3
Mol. Mass.379.492
SMILESCCCCCc1c(CO)c2cc(C)c(cc2n1CCc1ccccc1)C(O)=O